{"text_format":"1","workbook":"xlsx","n_sheets":4,"sheets":["Enteral Feed Prescription","Workings","Nutritional Data","To copy to Clinical Note"],"not_rendered":{"charts":0,"images":0,"macros":1,"external_links":0,"defined_names":3,"comments":0,"pivot_tables":0},"unopened":[],"bounds":{"document_bytes":16777216,"sheet_cells":100000,"rows_first":2000,"rows_last":500,"rows_between":2000,"halvings":0,"cell_chars":16384,"cell_head_chars":4096},"cells_cut":0,"cells_raw":0,"read":"whole","date_system":"1900"}

{"sheet":"Enteral Feed Prescription","index":0,"n_rows":47,"n_cols":7,"rows_kept":47,"cut":false,"hidden":false,"merged":[[13,1,13,6],[25,1,25,6],[33,1,33,6]]}
["Name:",null,null,"Date of Birth:"]
["Hospital Number:",null,null,"NHS Number:"]
["Gender:"]
["Date feeding commenced:"]
[]
["Reviewed by dietitian?"]
[{"$f":"IF(B6=\"Yes\",\"\",IF(B6=\"\",\"\",\"--- Review required?\"))","v":""}]
["Risk of refeeding synd?"]
[]
[null,null,null,null,null,null,{"$f":"IF(B6=\"yes\",\"\",IF(ISERROR(Workings!H10),\"\",Workings!H10))","v":""}]
[null,null,null,null,null,null,{"$f":"IF(B6=\"yes\",\"\",IF(ISERROR(Workings!H12),\"\",Workings!H12))","v":""}]
[null,{"$f":"IF(ISERROR(B10/((B11/100)*(B11/100))),\" \",(B10/((B11/100)*(B11/100))))","v":" "},{"$f":"IF(ISBLANK(C11),\"\",IF(ISBLANK(C10),\"\",IF(OR(C10=\"Certainty?\",C11=\"Certainty?\"),\"\",IF(C10=\"Estimated\",\"Estimated\",IF(C11=\"Estimated\",\"Estimated\",\"Actual\")))))","v":""}]
[]
["Feed type:"]
[]
[]
[]
[{"$f":"IF(B8=\"NO: No risk factors OR full feed established\",\"\",IF(B8=\"\",\"\",\"**REFEEDING RISK**\"))","v":""},{"$f":"IF(ISBLANK(B8),\"\",IF(A18=\"**REFEEDING RISK**\",\"- First 12 hrs: Correct electrolytes then start feed @ 10 ml/hr. Prescribe pabrinex 1 pair OD for 3 days\",\"\"))","v":""}]
[null,{"$f":"IF(ISBLANK(B8),\"\",(IF(G25>25,(IF(A18=\"**REFEEDING RISK**\",\"- Next 12 hrs: Re-check electrolytes. If no refeeding syndrome increase feed to 25 ml/hr\",\"**COMMENCE FEED AT 25 ml/hr FOR 4 HOURS THEN INCREASE TO GOAL RATE**\")),(IF(A18=\"**REFEEDING RISK**\",\"- Next 12 hrs: Re-check electrolytes.If no refeeding syndrome then variable feeding rate (MAX 25ml/hr)\",\"**LIMIT FEED RATE TO 25 ml/hr FOR FIRST 4 HOURS THEN FEED AT GOAL RATE **\")))))","v":""}]
[null,{"$f":"IF(ISBLANK(B8),\"\",IF(A18=\"**REFEEDING RISK**\",IF(B19=\"- Next 12 hrs: Re-check electrolytes. If no refeeding syndrome increase feed to 25 ml/hr\",\"- Thereafter: Recheck electrolytes. If no refeeding syndrome then variable rate feeding as below.\",\"- Thereafter: Recheck electrolytes. If no refeeding syndrome then variable rate feeding as below\"),\"\"))","v":""}]
[]
[]
[{"$f":"IF((TODAY()-$B$4)>Workings!$H$14,\"Full feed\",$B$4+Workings!$H$14)","v":"Full feed"}]
["Propofol rate (ml/hr)","Off","1-5","6-10","11-15","16-20","21-25"]
["Feed rate (ml/hr)",{"$f":"IF((ISERROR((IF((TODAY()-$B$4)>Workings!$H$14,(Workings!H60),(Workings!H17))))),\" \",(IF((TODAY()-$B$4)>Workings!$H$14,(Workings!H60),(Workings!H17))))","v":""},{"$f":"IF((ISERROR(IF((TODAY()-$B$4)>Workings!$H$14,(Workings!I60),(Workings!I17)))),\" \",IF((TODAY()-$B$4)>Workings!$H$14,(Workings!I60),(Workings!I17)))","v":""},{"$f":"IF((ISERROR(IF((TODAY()-$B$4)>Workings!$H$14,(Workings!J60),(Workings!J17)))),\" \",(IF((TODAY()-$B$4)>Workings!$H$14,(Workings!J60),(Workings!J17))))","v":""},{"$f":"IF((ISERROR(IF((TODAY()-$B$4)>Workings!$H$14,(Workings!K60),(Workings!K17)))),\" \",(IF((TODAY()-$B$4)>Workings!$H$14,(Workings!K60),(Workings!K17))))","v":""},{"$f":"IF((ISERROR(IF((TODAY()-$B$4)>Workings!$H$14,(Workings!L60),(Workings!L17)))),\" \",(IF((TODAY()-$B$4)>Workings!$H$14,(Workings!L60),(Workings!L17))))","v":""},{"$f":"IF((ISERROR(IF((TODAY()-$B$4)>Workings!$H$14,(Workings!M60),(Workings!M17)))),\" \",(IF(IF((TODAY()-$B$4)>Workings!$H$14,(Workings!M60),(Workings!M17))<5,\"0\",(IF((TODAY()-$B$4)>Workings!$H$14,(Workings!M60),(Workings!M17))))))","v":""}]
[{"$f":"Workings!G26","v":"Prosource TF sachet"},"Give 1 sachet in morning & evening if on >10 ml/hr propofol (otherwise no Prosource)"]
[]
[null,"Total feed & propofol volume:",null,{"$f":"IF((ISERROR(IF((TODAY()-B4)>Workings!$H$14,(IF(MIN(Workings!H68:M68)=MAX(Workings!H67:M67),CONCATENATE(MAX(Workings!H67:M67),\" ml\"),MIN(Workings!H68:M68))),(IF(MIN(Workings!H41:'Workings'!M41)=MAX(Workings!H40:M40),CONCATENATE(MAX(Workings!H40:M40),\" ml\"),MIN(Workings!H41:M41)))))),\" \",(IF((TODAY()-B4)>Workings!$H$14,(IF(MIN(Workings!H68:M68)=MAX(Workings!H67:M67),CONCATENATE(MAX(Workings!H67:M67),\" ml\"),MIN(Workings!H68:M68))),(IF(MIN(Workings!H41:'Workings'!M41)=MAX(Workings!H40:M40),CONCATENATE(MAX(Workings!H40:M40),\" ml\"),MIN(Workings!H41:M41))))))","v":" "},{"$f":"IF((ISERROR(IF((TODAY()-B4)>Workings!$H$14,(IF(MIN(Workings!H68:M68)=MAX(Workings!H67:M67),\"\",CONCATENATE(\"- \",MAX(Workings!H67:M67),\" ml\"))),(IF(MIN(Workings!H41:M41)=MAX(Workings!H40:M40),\"\",CONCATENATE(\"- \",MAX(Workings!H40:M40),\" ml\")))))),\" \",(IF((TODAY()-B4)>Workings!$H$14,(IF(MIN(Workings!H68:M68)=MAX(Workings!H67:M67),\"\",CONCATENATE(\"- \",MAX(Workings!H67:M67),\" ml\"))),(IF(MIN(Workings!H41:M41)=MAX(Workings!H40:M40),\"\",CONCATENATE(\"- \",MAX(Workings!H40:M40),\" ml\"))))))","v":" "}]
[]
[]
[{"$f":"IF((TODAY()-$B$4)>Workings!$H$14,\"\",B4+Workings!$H$14)","v":""}]
[{"$f":"IF((TODAY()-$B$4)>Workings!$H$14,\"\",\"Propofol rate (ml/hr)\")","v":""},{"$f":"IF((TODAY()-$B$4)>Workings!$H$14,\"\",\"Off\")","v":""},{"$f":"IF((TODAY()-$B$4)>Workings!$H$14,\"\",\"1-5\")","v":""},{"$f":"IF((TODAY()-$B$4)>Workings!$H$14,\"\",\"6-10\")","v":""},{"$f":"IF((TODAY()-$B$4)>Workings!$H$14,\"\",\"11-15\")","v":""},{"$f":"IF((TODAY()-$B$4)>Workings!$H$14,\"\",\"16-20\")","v":""},{"$f":"IF((TODAY()-$B$4)>Workings!$H$14,\"\",\"21-25\")","v":""}]
[{"$f":"IF((TODAY()-$B$4)>Workings!$H$14,\"\",\"Feed rate (ml/hr)\")","v":""},{"$f":"IF((TODAY()-$B$4)>Workings!$H$14,\"\",(Workings!H60))","v":""},{"$f":"IF((TODAY()-$B$4)>Workings!$H$14,\"\",(Workings!I60))","v":""},{"$f":"IF((TODAY()-$B$4)>Workings!$H$14,\"\",(Workings!J60))","v":""},{"$f":"IF((TODAY()-$B$4)>Workings!$H$14,\"\",(Workings!K60))","v":""},{"$f":"IF((TODAY()-$B$4)>Workings!$H$14,\"\",(Workings!L60))","v":""},{"$f":"IF((TODAY()-$B$4)>Workings!$H$14,\"\",(Workings!M60))","v":""}]
[{"$f":"IF((TODAY()-$B$4)>Workings!$H$14,\"\",A26)","v":""},{"$f":"IF((TODAY()-$B$4)>Workings!$H$14,\"\",\"Give 1 sachet in morning & evening if on >10 ml/hr propofol (otherwise no Prosource)\")","v":""}]
[]
[null,{"$f":"IF((TODAY()-B4)>Workings!$H$14,\"\",\"Total feed & propofol volume:\")","v":""},null,{"$f":"IF((TODAY()-B4)>Workings!$H$14,\"\",(IF(MIN(Workings!H68:M68)=MAX(Workings!H67:M67),CONCATENATE(MAX(Workings!H67:M67),\" ml\"),MIN(Workings!H68:M68))))","v":""},{"$f":"IF((TODAY()-B4)>Workings!$H$14,\"\",(IF(MIN(Workings!H68:M68)=MAX(Workings!H67:M67),\"\",CONCATENATE(\"- \",MAX(Workings!H67:M67),\" ml\"))))","v":""}]
[]
[]
[{"$f":"IF(C12=\"Estimated\",\"**THIS PRESCRIPTION USES AN ESTIMATED WEIGHT AND/OR HEIGHT, UPDATE WHEN ABLE**\",\"\")","v":""}]
[]
[]
[]
["Feed prescription update required (tick):  YES ❑       Date: _____________"]
[null,{"$f":"IF(B6=\"Yes\",\"**ANY PRESCRIPTION CHANGE MUST BE AGREED WITH A DIETITIAN**\",\"\")","v":""}]
["Reason (circle):","Dietitian review"]
[null,{"$f":"IF(C12=\"Estimated\",\"Accurate weight/height obtained\",\"\")","v":""}]
[null,"Other (specify)"]

{"sheet":"Workings","index":1,"n_rows":75,"n_cols":13,"rows_kept":75,"cut":false,"hidden":true,"merged":[]}
["Certainty?",null,null,null,null,null,"Calorie requirement calculations",null,null,"Dosing weight","CALORIE REQUIREMENT","Protein requirement"]
["Actual",null,null,"Male",null,null,"IF ABW < IBW+20%","Use actual weight",null,{"$f":"IF(ISBLANK('Enteral Feed Prescription'!B10), \"\",'Enteral Feed Prescription'!B10)","v":""},{"$f":"IF(ISBLANK('Enteral Feed Prescription'!B10), \"\",(J2*H6))","v":""},{"$f":"IF(ISBLANK('Enteral Feed Prescription'!B10), \"\",(J2*H7))","v":""}]
["Estimated",null,null,"Female",null,null,null,"IBW: 0.9*height in cm-(100M or106F)",{"$f":"IF(OR(ISBLANK('Enteral Feed Prescription'!B3),ISBLANK('Enteral Feed Prescription'!B11)), \"\",0.9*('Enteral Feed Prescription'!B11-(IF('Enteral Feed Prescription'!B3=\"Male\",100,106))))","v":""}]
[null,null,null,null,null,null,"IF ABW > IBW+20%","Use adjusted body weight","IBW+0.4x(actual weight-IBW)",{"$f":"IF(OR(ISBLANK('Enteral Feed Prescription'!B10),ISBLANK('Enteral Feed Prescription'!B11)),\"\",(I3+0.4*(J2-I3)))","v":""},{"$f":"IF(OR(ISBLANK('Enteral Feed Prescription'!B10),ISBLANK('Enteral Feed Prescription'!B11)), \"\",(J4*H6))","v":""},{"$f":"IF(OR(ISBLANK('Enteral Feed Prescription'!B10),ISBLANK('Enteral Feed Prescription'!B11)), \"\",(J4*H7))","v":""}]
["Yes","No","Calories/ml","Protein/ml",null,null,"(alternative IBW calculation, from https://academic.oup.com/ajcn/article/103/5/1197/4569587)","2.2*BMI + 3.5*BMI*(Ht-1.5m)",{"$f":"IF(OR(ISBLANK('Enteral Feed Prescription'!B12),ISBLANK('Enteral Feed Prescription'!B11)),\"\",(2.2*'Enteral Feed Prescription'!B12)+((('Enteral Feed Prescription'!B11-150)/100)*'Enteral Feed Prescription'!B12*3.5))","v":""}]
["OSMOLITE HP","OSMOLITE HP (first line)",1,6.2600000000000003E-2,null,null,"Calorie requirement kcal/kg/day",25]
["NEPRO","NEPRO (Hyperkalaemia/fluid-restriction)",1.8,8.1000000000000003E-2,null,null,"Protein requirement g/kg/day",1.3]
["OSMOLITE PLUS","OSMOLITE PLUS (halal option)",1.206,5.6000000000000001E-2,null,null,"FEED IN USE","Calories/ml","Protein/ml"]
["JEVITY PLUS",null,1.2230000000000001,5.5599999999999997E-2,null,null,{"$f":"'Enteral Feed Prescription'!B14","v":0},{"$f":"IF(G9=A12,C12,(IF(G9=A6,C6,(IF(G9=A8,C8,(IF(G9=A9,C9,(IF(G9=A10,C10,(IF(G9=A11,C11,(IF(G9=A7,C7,(IF(G9=B6,C6,(IF(G9=B7,C7,(IF(G9=B8,C8,\"\")))))))))))))))))))","v":""},{"$f":"IF(G9=A12,D12,(IF(G9=A6,D6,(IF(G9=A8,D8,(IF(G9=A9,D9,(IF(G9=A10,D10,(IF(G9=A11,D11,(IF(G9=A7,D7,(IF(G9=B6,D6,(IF(G9=B7,D7,(IF(G9=B8,D8,\"\")))))))))))))))))))","v":""}]
["JEVITY 1.5 kcal",null,1.5,6.3799999999999996E-2,null,null,"100% cal goal [ABW IF <(IBW+20%), otherise AdjBW]",{"$f":"IF('Enteral Feed Prescription'!B6=\"Yes\",'Enteral Feed Prescription'!F10,IF(J2<(I3*1.2),K2,K4))","v":{"$error":"#VALUE!"}}]
["TWOCAL",null,2,8.4000000000000005E-2,null,null,"70% calorie goal",{"$f":"H10*0.7","v":{"$error":"#VALUE!"}}]
["VITAL 1.5 kcal",null,1.5,6.7500000000000004E-2,null,null,"Protein goal",{"$f":"IF('Enteral Feed Prescription'!B6=\"Yes\",'Enteral Feed Prescription'!F11,IF(J2<(I3*1.2),L2,L4))","v":{"$error":"#VALUE!"}}]
[null,null,null,null,null,null,"Hours to feed",24]
["Propofol",null,1.1000000000000001,0,null,null,"Days of hypocaloric (<70%) feeding",3]
["Prosource TF",null,44,11,"NOT PER ML"]
[null,null,null,null,null,null,null,"Propofol off","1-5 ml/hr","6-10 ml/hr","11-15 ml/hr","16-20 ml/hr","21-25 ml/hr"]
[null,null,null,null,null,null,"Feed rate (70% goal)",{"$f":"MAX(0,ROUND(((($H$11-C19)/$H$13)/$H$9),0))","v":{"$error":"#VALUE!"}},{"$f":"MAX(0,ROUND(((($H$11-C20)/$H$13)/$H$9),0))","v":{"$error":"#VALUE!"}},{"$f":"MAX(0,ROUND((($H$11-C21)/$H$13/$H$9),0))","v":{"$error":"#VALUE!"}},{"$f":"MAX(0,ROUND((($H$11-C22)/$H$13/$H$9),0))","v":{"$error":"#VALUE!"}},{"$f":"MAX(0,ROUND((($H$11-C23)/$H$13/$H$9),0))","v":{"$error":"#VALUE!"}},{"$f":"MAX(0,ROUND((($H$11-C24)/$H$13/$H$9),0))","v":{"$error":"#VALUE!"}}]
["Propofol rate",null,"24hr calorie reduction","(lower propofol calories)",null,null,"Total calories (upper limit propofol)",{"$f":"(H17*$H$13*$H$9)+$C19","v":{"$error":"#VALUE!"}},{"$f":"(I17*$H$13*$H$9)+$C20","v":{"$error":"#VALUE!"}},{"$f":"(J17*$H$13*$H$9)+$C21","v":{"$error":"#VALUE!"}},{"$f":"(K17*$H$13*$H$9)+$C22","v":{"$error":"#VALUE!"}},{"$f":"(L17*$H$13*$H$9)+$C23","v":{"$error":"#VALUE!"}},{"$f":"(M17*$H$13*$H$9)+$C24","v":{"$error":"#VALUE!"}}]
["OFF",null,0,0,null,null,"Total calories (lower limit propofol)",{"$f":"(H17*$H$13*$H$9)+$D19","v":{"$error":"#VALUE!"}},{"$f":"(I17*$H$13*$H$9)+$D20","v":{"$error":"#VALUE!"}},{"$f":"(J17*$H$13*$H$9)+$D21","v":{"$error":"#VALUE!"}},{"$f":"(K17*$H$13*$H$9)+$D22","v":{"$error":"#VALUE!"}},{"$f":"(L17*$H$13*$H$9)+$D23","v":{"$error":"#VALUE!"}},{"$f":"(M17*$H$13*$H$9)+$D24","v":{"$error":"#VALUE!"}}]
["1-5 ml/hr",null,{"$f":"5*1.1*24","v":132},{"$f":"1*1.1*24","v":26.400000000000002},null,null,"%required calories (upper limit propofol)",{"$f":"(H18/$H$10)*100","v":{"$error":"#VALUE!"}},{"$error":"#VALUE!"},{"$error":"#VALUE!"},{"$error":"#VALUE!"},{"$error":"#VALUE!"},{"$error":"#VALUE!"}]
["6-10 ml/hs",null,{"$f":"10*1.1*24","v":264},{"$f":"6*1.1*24","v":158.4},null,null,"%required calories (lower limit propofol)",{"$error":"#VALUE!"},{"$error":"#VALUE!"},{"$error":"#VALUE!"},{"$error":"#VALUE!"},{"$error":"#VALUE!"},{"$error":"#VALUE!"}]
["11-15 ml/hr",null,{"$f":"15*1.1*24","v":396},{"$f":"11*1.1*24","v":290.40000000000003},null,null,"Protein ",{"$f":"H17*$H$13*$I$9","v":{"$error":"#VALUE!"}},{"$error":"#VALUE!"},{"$error":"#VALUE!"},{"$error":"#VALUE!"},{"$error":"#VALUE!"},{"$error":"#VALUE!"}]
["16-20 ml/hr",null,{"$f":"20*1.1*24","v":528},{"$f":"16*1.1*24","v":422.40000000000003},null,null,"Protein as % of goal",{"$f":"(H22/$H$12)*100","v":{"$error":"#VALUE!"}},{"$error":"#VALUE!"},{"$error":"#VALUE!"},{"$error":"#VALUE!"},{"$error":"#VALUE!"},{"$error":"#VALUE!"}]
["21-25 ml/hr",null,{"$f":"25*1.1*24","v":660.00000000000011},{"$f":"21*1.1*24","v":554.40000000000009},null,null,"Protein deficit",{"$f":"MAX(0,$H$12-H22)","v":{"$error":"#VALUE!"}},{"$error":"#VALUE!"},{"$error":"#VALUE!"},{"$error":"#VALUE!"},{"$error":"#VALUE!"},{"$error":"#VALUE!"}]
[null,null,null,null,null,null,"Prosource sachets (as agreed)",0,0,0,2,2,2]
[null,null,null,null,null,null,"Prosource TF sachet",{"$f":"IF(Workings!H25=0,\"Nil\",IF(Workings!H25=1,\"OD\",IF(Workings!H25=2,\"BD\",IF(Workings!H25=3,\"TDS\",IF(Workings!H25=4,\"QID\")))))","v":"Nil"},{"$f":"IF(Workings!I25=0,\"Nil\",IF(Workings!I25=1,\"OD\",IF(Workings!I25=2,\"BD\",IF(Workings!I25=3,\"TDS\",IF(Workings!I25=4,\"QID\")))))","v":"Nil"},{"$f":"IF(Workings!J25=0,\"Nil\",IF(Workings!J25=1,\"OD\",IF(Workings!J25=2,\"BD\",IF(Workings!J25=3,\"TDS\",IF(Workings!J25=4,\"QID\")))))","v":"Nil"},{"$f":"IF(Workings!K25=0,\"Nil\",IF(Workings!K25=1,\"OD\",IF(Workings!K25=2,\"BD\",IF(Workings!K25=3,\"TDS\",IF(Workings!K25=4,\"QID\")))))","v":"BD"},{"$f":"IF(Workings!L25=0,\"Nil\",IF(Workings!L25=1,\"OD\",IF(Workings!L25=2,\"BD\",IF(Workings!L25=3,\"TDS\",IF(Workings!L25=4,\"QID\")))))","v":"BD"},{"$f":"IF(Workings!M25=0,\"Nil\",IF(Workings!M25=1,\"OD\",IF(Workings!M25=2,\"BD\",IF(Workings!M25=3,\"TDS\",IF(Workings!M25=4,\"QID\")))))","v":"BD"}]
["Refeeding risk?",null,null,null,null,null,"Total calories with prosource (upper)",{"$f":"H18+(H25*$C$15)","v":{"$error":"#VALUE!"}},{"$error":"#VALUE!"},{"$error":"#VALUE!"},{"$error":"#VALUE!"},{"$error":"#VALUE!"},{"$error":"#VALUE!"}]
[null,null,null,null,null,null,"Total calories with prosource (lower)",{"$f":"H19+(H25*$C$15)","v":{"$error":"#VALUE!"}},{"$error":"#VALUE!"},{"$error":"#VALUE!"},{"$error":"#VALUE!"},{"$error":"#VALUE!"},{"$error":"#VALUE!"}]
["NO: No risk factors OR full feed established",null,null,null,null,null,"%goal calories (upper limit propofol with prosource)",{"$f":"(H27/$H$10)*100","v":{"$error":"#VALUE!"}},{"$error":"#VALUE!"},{"$error":"#VALUE!"},{"$error":"#VALUE!"},{"$error":"#VALUE!"},{"$error":"#VALUE!"}]
["YES",null,null,null,null,null,"%goal calories (lower limit propofol with prosource)",{"$f":"(H28/$H$10)*100","v":{"$error":"#VALUE!"}},{"$error":"#VALUE!"},{"$error":"#VALUE!"},{"$error":"#VALUE!"},{"$error":"#VALUE!"},{"$error":"#VALUE!"}]
[null,null,null,null,null,null,"Total protein with prosource",{"$f":"H22+(11*H25)","v":{"$error":"#VALUE!"}},{"$error":"#VALUE!"},{"$error":"#VALUE!"},{"$error":"#VALUE!"},{"$error":"#VALUE!"},{"$error":"#VALUE!"}]
[null,null,null,null,null,null,"Protein with prosource as % of goal",{"$f":"(H31/$H$12)*100","v":{"$error":"#VALUE!"}},{"$error":"#VALUE!"},{"$error":"#VALUE!"},{"$error":"#VALUE!"},{"$error":"#VALUE!"},{"$error":"#VALUE!"}]
[null,null,null,null,null,null,"Adjusted feed rate (avoid >70% calories)",{"$f":"IF(ISERROR(MAX(0,ROUNDDOWN(IF(H29<70,H17,(H17-(((H27-$H$11)/$H$9)/$H$13))),0))),\"\",(MAX(0,ROUNDDOWN(IF(H29<70,H17,(H17-(((H27-$H$11)/$H$9)/$H$13))),0))))","v":""},"","","","",""]
[null,null,null,null,null,null,"Total calories with prosource (upper, adjusted rate)",{"$f":"IF(ISERROR((H33*$H$13*$H$9)+$C19+(H25*$C$15)),\"\",((H33*$H$13*$H$9)+$C19+(H25*$C$15)))","v":""},{"$f":"IF(ISERROR((I33*$H$13*$H$9)+$C20+(I25*C15)),\"\",((I33*$H$13*$H$9)+$C20+(I25*C15)))","v":""},{"$f":"IF(ISERROR((J33*$H$13*$H$9)+$C21+(J25*C15)),\"\",((J33*$H$13*$H$9)+$C21+(J25*C15)))","v":""},{"$f":"IF(ISERROR((K33*$H$13*$H$9)+$C22+(K25*C15)),\"\",((K33*$H$13*$H$9)+$C22+(K25*C15)))","v":""},{"$f":"IF(ISERROR((L33*$H$13*$H$9)+$C23+(L25*C15)),\"\",((L33*$H$13*$H$9)+$C23+(L25*C15)))","v":""},{"$f":"IF(ISERROR((M33*$H$13*$H$9)+$C24+(M25*C15)),\"\",((M33*$H$13*$H$9)+$C24+(M25*C15)))","v":""}]
[null,null,null,null,null,null,"Total calories with prosource (lower, adjusted rate)",{"$f":"IF(ISERROR((H33*$H$13*$H$9)+$D19+(H25*C15)),\"\",((H33*$H$13*$H$9)+$D19+(H25*C15)))","v":""},{"$f":"IF(ISERROR((I33*$H$13*$H$9)+$D20+(I25*C15)),\"\",((I33*$H$13*$H$9)+$D20+(I25*C15)))","v":""},{"$f":"IF(ISERROR((J33*$H$13*$H$9)+$D21+(J25*C15)),\"\",((J33*$H$13*$H$9)+$D21+(J25*C15)))","v":""},{"$f":"IF(ISERROR((K33*$H$13*$H$9)+$D22+(K25*C15)),\"\",((K33*$H$13*$H$9)+$D22+(K25*C15)))","v":""},{"$f":"IF(ISERROR((L33*$H$13*$H$9)+$D23+(L25*C15)),\"\",((L33*$H$13*$H$9)+$D23+(L25*C15)))","v":""},{"$f":"IF(ISERROR((M33*$H$13*$H$9)+$D24+(M25*C15)),\"\",((M33*$H$13*$H$9)+$D24+(M25*C15)))","v":""}]
[null,null,null,null,null,null,"%goal calories (upper with prosource, adjusted rate)",{"$f":"IF(ISERROR((H34/$H$10)*100),\"\",((H34/$H$10)*100))","v":""},{"$f":"IF(ISERROR((I34/$H$10)*100),\"\",((I34/$H$10)*100))","v":""},"","","",""]
[null,null,null,null,null,null,"%goal calories (lower with prosource, adjusted rate)",{"$f":"IF(ISERROR((H35/$H$10)*100),\"\",((H35/$H$10)*100))","v":""},{"$f":"IF(ISERROR((I35/$H$10)*100),\"\",((I35/$H$10)*100))","v":""},"","","",""]
[null,null,null,null,null,null,"Total protein with prosource (adjusted rate)",{"$f":"IF(ISERROR((H33*$H$13*$I$9)+(11*H25)),\"\",((H33*$H$13*$I$9)+(11*H25)))","v":""},{"$f":"IF(ISERROR((I33*$H$13*$I$9)+(11*I25)),\"\",((I33*$H$13*$I$9)+(11*I25)))","v":""},"","","",""]
[null,null,null,null,null,null,"Protein as % of goal",{"$f":"IF(ISERROR((H38/$H$12)*100),\"\",((H38/$H$12)*100))","v":""},{"$f":"IF(ISERROR((I38/$H$12)*100),\"\",((I38/$H$12)*100))","v":""},"","","",""]
[null,null,null,null,null,null,"Total volume (feed & propofol) UPPER",{"$f":"(H33*$H$13)+(H70*24)","v":{"$error":"#VALUE!"}},{"$error":"#VALUE!"},{"$error":"#VALUE!"},{"$error":"#VALUE!"},{"$error":"#VALUE!"},{"$error":"#VALUE!"}]
[null,null,null,null,null,null,"Total volume (feed & propofol) LOWER",{"$f":"(H33*$H$13)+(H71*24)","v":{"$error":"#VALUE!"}},{"$error":"#VALUE!"},{"$error":"#VALUE!"},{"$error":"#VALUE!"},{"$error":"#VALUE!"},{"$error":"#VALUE!"}]
[]
[null,null,null,null,null,null,null,"Propofol off","1-5 ml/hr","6-10 ml/hr","11-15 ml/hr","16-20 ml/hr","21-25 ml/hr"]
[null,null,null,null,null,null,"Feed rate (100% goal)",{"$f":"MAX(0,ROUND((($H$10-C19)/$H$13/$H$9),0))","v":{"$error":"#VALUE!"}},{"$f":"MAX(0,ROUND((($H$10-C20)/$H$13/$H$9),0))","v":{"$error":"#VALUE!"}},{"$f":"MAX(0,ROUND((($H$10-C21)/$H$13/$H$9),0))","v":{"$error":"#VALUE!"}},{"$f":"MAX(0,ROUND((($H$10-C22)/$H$13/$H$9),0))","v":{"$error":"#VALUE!"}},{"$f":"MAX(0,ROUND((($H$10-C23)/$H$13/$H$9),0))","v":{"$error":"#VALUE!"}},{"$f":"MAX(0,ROUND((($H$10-C24)/$H$13/$H$9),0))","v":{"$error":"#VALUE!"}}]
[null,null,null,null,null,null,"Total calories (upper limit propofol)",{"$f":"(H44*$H$13*$H$9)+$C19","v":{"$error":"#VALUE!"}},{"$f":"(I44*$H$13*$H$9)+$C20","v":{"$error":"#VALUE!"}},{"$f":"(J44*$H$13*$H$9)+$C21","v":{"$error":"#VALUE!"}},{"$f":"(K44*$H$13*$H$9)+$C22","v":{"$error":"#VALUE!"}},{"$f":"(L44*$H$13*$H$9)+$C23","v":{"$error":"#VALUE!"}},{"$f":"(M44*$H$13*$H$9)+$C24","v":{"$error":"#VALUE!"}}]
[null,null,null,null,null,null,"Total calories (lower limit propofol)",{"$f":"(H44*$H$13*$H$9)+$D19","v":{"$error":"#VALUE!"}},{"$f":"(I44*$H$13*$H$9)+$D20","v":{"$error":"#VALUE!"}},{"$f":"(J44*$H$13*$H$9)+$D21","v":{"$error":"#VALUE!"}},{"$f":"(K44*$H$13*$H$9)+$D22","v":{"$error":"#VALUE!"}},{"$f":"(L44*$H$13*$H$9)+$D23","v":{"$error":"#VALUE!"}},{"$f":"(M44*$H$13*$H$9)+$D24","v":{"$error":"#VALUE!"}}]
[null,null,null,null,null,null,"%goal calories (upper limit propofol)",{"$f":"(H45/$H$10)*100","v":{"$error":"#VALUE!"}},{"$error":"#VALUE!"},{"$error":"#VALUE!"},{"$error":"#VALUE!"},{"$error":"#VALUE!"},{"$error":"#VALUE!"}]
[null,null,null,null,null,null,"%goal calories (lower limit propofol)",{"$error":"#VALUE!"},{"$error":"#VALUE!"},{"$error":"#VALUE!"},{"$error":"#VALUE!"},{"$error":"#VALUE!"},{"$error":"#VALUE!"}]
[null,null,null,null,null,null,"Protein ",{"$f":"H44*$H$13*$I$9","v":{"$error":"#VALUE!"}},{"$error":"#VALUE!"},{"$error":"#VALUE!"},{"$error":"#VALUE!"},{"$error":"#VALUE!"},{"$error":"#VALUE!"}]
[null,null,null,null,null,null,"Protein as % of goal",{"$f":"(H49/$H$12)*100","v":{"$error":"#VALUE!"}},{"$error":"#VALUE!"},{"$error":"#VALUE!"},{"$error":"#VALUE!"},{"$error":"#VALUE!"},{"$error":"#VALUE!"}]
[null,null,null,null,null,null,"Protein deficit",{"$f":"MAX(0,$H$12-H49)","v":{"$error":"#VALUE!"}},{"$error":"#VALUE!"},{"$error":"#VALUE!"},{"$error":"#VALUE!"},{"$error":"#VALUE!"},{"$error":"#VALUE!"}]
[null,null,null,null,null,null,"Prosource sachets (as agreed)",0,0,0,2,2,2]
[null,null,null,null,null,null,"Prosource TF sachet",{"$f":"IF(Workings!H52=0,\"Nil\",IF(Workings!H52=1,\"OD\",IF(Workings!H52=2,\"BD\",IF(Workings!H52=3,\"TDS\",IF(Workings!H52=4,\"QID\")))))","v":"Nil"},{"$f":"IF(Workings!I52=0,\"Nil\",IF(Workings!I52=1,\"OD\",IF(Workings!I52=2,\"BD\",IF(Workings!I52=3,\"TDS\",IF(Workings!I52=4,\"QID\")))))","v":"Nil"},{"$f":"IF(Workings!J52=0,\"Nil\",IF(Workings!J52=1,\"OD\",IF(Workings!J52=2,\"BD\",IF(Workings!J52=3,\"TDS\",IF(Workings!J52=4,\"QID\")))))","v":"Nil"},{"$f":"IF(Workings!K52=0,\"Nil\",IF(Workings!K52=1,\"OD\",IF(Workings!K52=2,\"BD\",IF(Workings!K52=3,\"TDS\",IF(Workings!K52=4,\"QID\")))))","v":"BD"},{"$f":"IF(Workings!L52=0,\"Nil\",IF(Workings!L52=1,\"OD\",IF(Workings!L52=2,\"BD\",IF(Workings!L52=3,\"TDS\",IF(Workings!L52=4,\"QID\")))))","v":"BD"},{"$f":"IF(Workings!M52=0,\"Nil\",IF(Workings!M52=1,\"OD\",IF(Workings!M52=2,\"BD\",IF(Workings!M52=3,\"TDS\",IF(Workings!M52=4,\"QID\")))))","v":"BD"}]
[null,null,null,null,null,null,"Total calories with prosource (upper)",{"$f":"H45+(H52*$C$15)","v":{"$error":"#VALUE!"}},{"$f":"I45+(I52*$C$15)","v":{"$error":"#VALUE!"}},{"$error":"#VALUE!"},{"$error":"#VALUE!"},{"$error":"#VALUE!"},{"$error":"#VALUE!"}]
[null,null,null,null,null,null,"Total calories with prosource (lower)",{"$f":"H46+(H52*$C$15)","v":{"$error":"#VALUE!"}},{"$f":"I46+(I52*$C$15)","v":{"$error":"#VALUE!"}},{"$error":"#VALUE!"},{"$error":"#VALUE!"},{"$error":"#VALUE!"},{"$error":"#VALUE!"}]
[null,null,null,null,null,null,"%goal calories (upper limit propofol with prosource)",{"$f":"(H54/$H$10)*100","v":{"$error":"#VALUE!"}},{"$error":"#VALUE!"},{"$error":"#VALUE!"},{"$error":"#VALUE!"},{"$error":"#VALUE!"},{"$error":"#VALUE!"}]
[null,null,null,null,null,null,"%goal calories (lower limit propofol with prosource)",{"$error":"#VALUE!"},{"$error":"#VALUE!"},{"$error":"#VALUE!"},{"$error":"#VALUE!"},{"$error":"#VALUE!"},{"$error":"#VALUE!"}]
[null,null,null,null,null,null,"Total protein with prosource",{"$f":"H49+(11*H52)","v":{"$error":"#VALUE!"}},{"$f":"I49+(11*I52)","v":{"$error":"#VALUE!"}},{"$error":"#VALUE!"},{"$error":"#VALUE!"},{"$error":"#VALUE!"},{"$error":"#VALUE!"}]
[null,null,null,null,null,null,"Protein with prosource as % of goal",{"$f":"(H58/$H$12)*100","v":{"$error":"#VALUE!"}},{"$error":"#VALUE!"},{"$error":"#VALUE!"},{"$error":"#VALUE!"},{"$error":"#VALUE!"},{"$error":"#VALUE!"}]
[null,null,null,null,null,null,"Adjusted feed rate (avoid >110% calories)",{"$f":"IF((ISERROR(MAX(0,ROUNDDOWN(IF(H56<110,H44,(H44-(((H54-$H$10)/$H$9)/$H$13))),0)))),\"\",(MAX(0,ROUNDDOWN(IF(H56<110,H44,(H44-(((H54-$H$10)/$H$9)/$H$13))),0))))","v":""},{"$f":"IF((ISERROR(MAX(0,ROUNDDOWN(IF(I56<110,I44,(I44-(((I54-$H$10)/$H$9)/$H$13))),0)))),\"\",(MAX(0,ROUNDDOWN(IF(I56<110,I44,(I44-(((I54-$H$10)/$H$9)/$H$13))),0))))","v":""},"","","",""]
[null,null,null,null,null,null,"Total calories with prosource (upper, adjusted rate)",{"$f":"IF(ISERROR((H60*$H$13*$H$9)+$C19+(H52*$C$15)),\"\",((H60*$H$13*$H$9)+$C19+(H52*$C$15)))","v":""},{"$f":"IF(ISERROR((I60*$H$13*$H$9)+$C20+(I52*$C$15)),\"\",((I60*$H$13*$H$9)+$C20+(I52*$C$15)))","v":""},{"$f":"IF(ISERROR((J60*$H$13*$H$9)+$C21+(J52*$C$15)),\"\",((J60*$H$13*$H$9)+$C21+(J52*$C$15)))","v":""},{"$f":"IF(ISERROR((K60*$H$13*$H$9)+$C22+(K52*$C$15)),\"\",((K60*$H$13*$H$9)+$C22+(K52*$C$15)))","v":""},{"$f":"IF(ISERROR((L60*$H$13*$H$9)+$C23+(L52*$C$15)),\"\",((L60*$H$13*$H$9)+$C23+(L52*$C$15)))","v":""},{"$f":"IF(ISERROR((M60*$H$13*$H$9)+$C24+(M52*$C$15)),\"\",((M60*$H$13*$H$9)+$C24+(M52*$C$15)))","v":""}]
[null,null,null,null,null,null,"Total calories with prosource (lower, adjusted rate)",{"$f":"IF(ISERROR((H60*$H$13*$H$9)+$D19+(H52*$C$15)),\"\",((H60*$H$13*$H$9)+$D19+(H52*$C$15)))","v":""},{"$f":"IF(ISERROR((I60*$H$13*$H$9)+$D20+(I52*$C$15)),\"\",((I60*$H$13*$H$9)+$D20+(I52*$C$15)))","v":""},{"$f":"IF(ISERROR((J60*$H$13*$H$9)+$D21+(J52*$C$15)),\"\",((J60*$H$13*$H$9)+$D21+(J52*$C$15)))","v":""},{"$f":"IF(ISERROR((K60*$H$13*$H$9)+$D22+(K52*$C$15)),\"\",((K60*$H$13*$H$9)+$D22+(K52*$C$15)))","v":""},{"$f":"IF(ISERROR((L60*$H$13*$H$9)+$D23+(L52*$C$15)),\"\",((L60*$H$13*$H$9)+$D23+(L52*$C$15)))","v":""},{"$f":"IF(ISERROR((M60*$H$13*$H$9)+$D24+(M52*$C$15)),\"\",((M60*$H$13*$H$9)+$D24+(M52*$C$15)))","v":""}]
[null,null,null,null,null,null,"%goal calories (upper with prosource, adjusted rate)",{"$f":"IF(ISERROR((H61/$H$10)*100),\"\",((H61/$H$10)*100))","v":""},{"$f":"IF(ISERROR((I61/$H$10)*100),\"\",((I61/$H$10)*100))","v":""},{"$f":"IF(ISERROR((J61/$H$10)*100),\"\",((J61/$H$10)*100))","v":""},"","",""]
[null,null,null,null,null,null,"%goal calories (lower with prosource, adjusted rate)",{"$f":"IF(ISERROR((H62/$H$10)*100),\"\",((H62/$H$10)*100))","v":""},{"$f":"IF(ISERROR((I62/$H$10)*100),\"\",((I62/$H$10)*100))","v":""},"","","",""]
[null,null,null,null,null,null,"Total protein with prosource (adjusted rate)",{"$f":"IF(ISERROR((H60*$H$13*$I$9)+(11*H52)),\"\",((H60*$H$13*$I$9)+(11*H52)))","v":""},{"$f":"IF(ISERROR((I60*$H$13*$I$9)+(11*I52)),\"\",((I60*$H$13*$I$9)+(11*I52)))","v":""},"","","",""]
[null,null,null,null,null,null,"Protein as % of goal",{"$f":"IF(ISERROR((H65/$H$12)*100),\"\",((H65/$H$12)*100))","v":""},{"$f":"IF(ISERROR((I65/$H$12)*100),\"\",((I65/$H$12)*100))","v":""},"","","",""]
[null,null,null,null,null,null,"Total volume (feed & propofol) UPPER",{"$f":"(H60*$H$13)+(H70*24)","v":{"$error":"#VALUE!"}},{"$error":"#VALUE!"},{"$error":"#VALUE!"},{"$error":"#VALUE!"},{"$error":"#VALUE!"},{"$error":"#VALUE!"}]
[null,null,null,null,null,null,"Total volume (feed & propofol) LOWER",{"$f":"(H60*$H$13)+(H71*24)","v":{"$error":"#VALUE!"}},{"$error":"#VALUE!"},{"$error":"#VALUE!"},{"$error":"#VALUE!"},{"$error":"#VALUE!"},{"$error":"#VALUE!"}]
[]
[null,null,null,null,null,null,"Upper propofol rate",0,5,10,15,20,25]
[null,null,null,null,null,null,"Lower propofol rate",0,1,6,11,16,21]
[]
[]
[]
[{"$f":"IF(B6=\"Yes\",\"\",IF(ISERROR(Workings!H10),\" \",Workings!H10))","v":" "}]

{"sheet":"Nutritional Data","index":2,"n_rows":19,"n_cols":7,"rows_kept":19,"cut":false,"hidden":false,"merged":[]}
["Hypocaloric feeding (<70% of goal calories)",{"$f":"Workings!H16","v":"Propofol off"},{"$f":"Workings!I16","v":"1-5 ml/hr"},{"$f":"Workings!J16","v":"6-10 ml/hr"},{"$f":"Workings!K16","v":"11-15 ml/hr"},{"$f":"Workings!L16","v":"16-20 ml/hr"},{"$f":"Workings!M16","v":"21-25 ml/hr"}]
["Feed rate",{"$f":"Workings!H33","v":""},{"$f":"Workings!I33","v":""},{"$f":"Workings!J33","v":""},{"$f":"Workings!K33","v":""},{"$f":"Workings!L33","v":""},{"$f":"Workings!M33","v":""}]
[{"$f":"Workings!G26","v":"Prosource TF sachet"},{"$f":"Workings!H26","v":"Nil"},{"$f":"Workings!I26","v":"Nil"},{"$f":"Workings!J26","v":"Nil"},{"$f":"Workings!K26","v":"BD"},{"$f":"Workings!L26","v":"BD"},{"$f":"Workings!M26","v":"BD"}]
["Total calories (higher rate propofol)",{"$f":"Workings!H34","v":""},{"$f":"Workings!I34","v":""},{"$f":"Workings!J34","v":""},{"$f":"Workings!K34","v":""},{"$f":"Workings!L34","v":""},{"$f":"Workings!M34","v":""}]
["Total calories (lower rate propofol)",{"$f":"Workings!H35","v":""},{"$f":"Workings!I35","v":""},{"$f":"Workings!J35","v":""},{"$f":"Workings!K35","v":""},{"$f":"Workings!L35","v":""},{"$f":"Workings!M35","v":""}]
["%goal calories (higher rate propofol)",{"$f":"Workings!H36","v":""},{"$f":"Workings!I36","v":""},{"$f":"Workings!J36","v":""},{"$f":"Workings!K36","v":""},{"$f":"Workings!L36","v":""},{"$f":"Workings!M36","v":""}]
["%goal calories (lower rate propofol)",{"$f":"Workings!H37","v":""},{"$f":"Workings!I37","v":""},{"$f":"Workings!J37","v":""},{"$f":"Workings!K37","v":""},{"$f":"Workings!L37","v":""},{"$f":"Workings!M37","v":""}]
["Total protein",{"$f":"Workings!H38","v":""},{"$f":"Workings!I38","v":""},{"$f":"Workings!J38","v":""},{"$f":"Workings!K38","v":""},{"$f":"Workings!L38","v":""},{"$f":"Workings!M38","v":""}]
["%goal protein",{"$f":"Workings!H39","v":""},{"$f":"Workings!I39","v":""},{"$f":"Workings!J39","v":""},{"$f":"Workings!K39","v":""},{"$f":"Workings!L39","v":""},{"$f":"Workings!M39","v":""}]
[]
["Full feed (85-110% of goal calories)",{"$f":"Workings!H43","v":"Propofol off"},{"$f":"Workings!I43","v":"1-5 ml/hr"},{"$f":"Workings!J43","v":"6-10 ml/hr"},{"$f":"Workings!K43","v":"11-15 ml/hr"},{"$f":"Workings!L43","v":"16-20 ml/hr"},{"$f":"Workings!M43","v":"21-25 ml/hr"}]
["Feed rate",{"$f":"Workings!H60","v":""},{"$f":"Workings!I60","v":""},{"$f":"Workings!J60","v":""},{"$f":"Workings!K60","v":""},{"$f":"Workings!L60","v":""},{"$f":"Workings!M60","v":""}]
[{"$f":"Workings!G53","v":"Prosource TF sachet"},{"$f":"Workings!H53","v":"Nil"},{"$f":"Workings!I53","v":"Nil"},{"$f":"Workings!J53","v":"Nil"},{"$f":"Workings!K53","v":"BD"},{"$f":"Workings!L53","v":"BD"},{"$f":"Workings!M53","v":"BD"}]
["Total calories (higher rate propofol)",{"$f":"Workings!H61","v":""},{"$f":"Workings!I61","v":""},{"$f":"Workings!J61","v":""},{"$f":"Workings!K61","v":""},{"$f":"Workings!L61","v":""},{"$f":"Workings!M61","v":""}]
["Total calories (lower rate propofol)",{"$f":"Workings!H62","v":""},{"$f":"Workings!I62","v":""},{"$f":"Workings!J62","v":""},{"$f":"Workings!K62","v":""},{"$f":"Workings!L62","v":""},{"$f":"Workings!M62","v":""}]
["%goal calories (higher rate propofol)",{"$f":"Workings!H63","v":""},{"$f":"Workings!I63","v":""},{"$f":"Workings!J63","v":""},{"$f":"Workings!K63","v":""},{"$f":"Workings!L63","v":""},{"$f":"Workings!M63","v":""}]
["%goal calories (lower rate propofol)",{"$f":"Workings!H64","v":""},{"$f":"Workings!I64","v":""},{"$f":"Workings!J64","v":""},{"$f":"Workings!K64","v":""},{"$f":"Workings!L64","v":""},{"$f":"Workings!M64","v":""}]
["Total protein",{"$f":"Workings!H65","v":""},{"$f":"Workings!I65","v":""},{"$f":"Workings!J65","v":""},{"$f":"Workings!K65","v":""},{"$f":"Workings!L65","v":""},{"$f":"Workings!M65","v":""}]
["%goal protein",{"$f":"Workings!H66","v":""},{"$f":"Workings!I66","v":""},{"$f":"Workings!J66","v":""},{"$f":"Workings!K66","v":""},{"$f":"Workings!L66","v":""},{"$f":"Workings!M66","v":""}]

{"sheet":"To copy to Clinical Note","index":3,"n_rows":36,"n_cols":7,"rows_kept":36,"cut":false,"hidden":true,"merged":[[31,0,31,6],[32,0,32,6],[33,0,33,6],[14,1,14,6],[3,1,3,6],[6,1,6,6],[19,0,19,6],[24,0,24,6],[30,0,30,6],[22,1,22,6],[27,1,27,6]]}
["Enteral feed prescription"]
["Date:",{"$f":"TODAY()","v":"2019-11-05"}]
[]
["Patient:",{"$f":"'Enteral Feed Prescription'!B1","v":0}]
["Hospital Number:",{"$f":"'Enteral Feed Prescription'!B2","v":0}]
["Gender:",{"$f":"'Enteral Feed Prescription'!B3","v":0}]
["Dietitian review?",{"$f":"'Enteral Feed Prescription'!B6","v":0}]
[{"$f":"'Enteral Feed Prescription'!A7","v":""},{"$f":"'Enteral Feed Prescription'!B7","v":"00:00:00"}]
[{"$f":"'Enteral Feed Prescription'!A11","v":0},{"$f":"'Enteral Feed Prescription'!B11","v":0},{"$f":"'Enteral Feed Prescription'!C11","v":0}]
[{"$f":"'Enteral Feed Prescription'!A10","v":0},{"$f":"'Enteral Feed Prescription'!B10","v":0},{"$f":"'Enteral Feed Prescription'!C10","v":0}]
[{"$f":"'Enteral Feed Prescription'!A12","v":0},{"$f":"'Enteral Feed Prescription'!B12","v":" "},{"$f":"'Enteral Feed Prescription'!C12","v":""}]
["Caloric requirements:",{"$f":"IF(ISBLANK('Enteral Feed Prescription'!F10),'Enteral Feed Prescription'!G10,'Enteral Feed Prescription'!F10)","v":""}]
["Protein requirements:",{"$f":"IF(ISBLANK('Enteral Feed Prescription'!F11),'Enteral Feed Prescription'!G11,'Enteral Feed Prescription'!F11)","v":""}]
[]
["Feed type",{"$f":"IF('Enteral Feed Prescription'!B14=\"Osmolite HP (first line)\",\"Osmolite HP\",IF(('Enteral Feed Prescription'!B14)=\"Nepro (Renal failure & hyperkalaemia/fluid-restriction)\",\"Nepro\",IF(('Enteral Feed Prescription'!B14)=\"Osmolite Plus (halal/soya protein free option)\",\"Osmolite Plus\",'Enteral Feed Prescription'!B14)))","v":0}]
[]
[{"$f":"'Enteral Feed Prescription'!A18","v":""},{"$f":"'Enteral Feed Prescription'!B18","v":""}]
[null,{"$f":"'Enteral Feed Prescription'!B19","v":""}]
[null,{"$f":"'Enteral Feed Prescription'!B20","v":""}]
[{"$f":"'Enteral Feed Prescription'!A23","v":"Full feed"}]
[{"$f":"'Enteral Feed Prescription'!A24","v":"Propofol rate (ml/hr)"},{"$f":"'Enteral Feed Prescription'!B24","v":"Off"},{"$f":"'Enteral Feed Prescription'!C24","v":"1-5"},{"$f":"'Enteral Feed Prescription'!D24","v":"6-10"},{"$f":"'Enteral Feed Prescription'!E24","v":"11-15"},{"$f":"'Enteral Feed Prescription'!F24","v":"16-20"},{"$f":"'Enteral Feed Prescription'!G24","v":"21-25"}]
[{"$f":"'Enteral Feed Prescription'!A25","v":"Feed rate (ml/hr)"},{"$f":"'Enteral Feed Prescription'!B25","v":""},{"$f":"'Enteral Feed Prescription'!C25","v":""},{"$f":"'Enteral Feed Prescription'!D25","v":""},{"$f":"'Enteral Feed Prescription'!E25","v":""},{"$f":"'Enteral Feed Prescription'!F25","v":""},{"$f":"'Enteral Feed Prescription'!G25","v":""}]
[{"$f":"'Enteral Feed Prescription'!A26","v":"Prosource TF sachet"},{"$f":"'Enteral Feed Prescription'!B26","v":"Give 1 sachet in morning & evening if on >10 ml/hr propofol (otherwise no Prosource)"}]
[]
[{"$f":"'Enteral Feed Prescription'!A31","v":""}]
[{"$f":"'Enteral Feed Prescription'!A32","v":""},{"$f":"'Enteral Feed Prescription'!B32","v":""},{"$f":"'Enteral Feed Prescription'!C32","v":""},{"$f":"'Enteral Feed Prescription'!D32","v":""},{"$f":"'Enteral Feed Prescription'!E32","v":""},{"$f":"'Enteral Feed Prescription'!F32","v":""},{"$f":"'Enteral Feed Prescription'!G32","v":""}]
[{"$f":"'Enteral Feed Prescription'!A33","v":""},{"$f":"'Enteral Feed Prescription'!B33","v":""},{"$f":"'Enteral Feed Prescription'!C33","v":""},{"$f":"'Enteral Feed Prescription'!D33","v":""},{"$f":"'Enteral Feed Prescription'!E33","v":""},{"$f":"'Enteral Feed Prescription'!F33","v":""},{"$f":"'Enteral Feed Prescription'!G33","v":""}]
[{"$f":"'Enteral Feed Prescription'!A34","v":""},{"$f":"'Enteral Feed Prescription'!B34","v":""}]
[]
["ACTIONS REQUIRED"]
[{"$f":"\"1. Prescribe 'Free Text Dietetic Product': \" & B15 & \" at rate \" & MAX(B22:G22,B27:G27) & \" ml/hr.  In 'Additional Info' enter 'VARIABLE RATE ACCORDING AS PER FEEDING PRESCRIPTION\"","v":"1. Prescribe 'Free Text Dietetic Product': 0 at rate 0 ml/hr.  In 'Additional Info' enter 'VARIABLE RATE ACCORDING AS PER FEEDING PRESCRIPTION"}]
["2. Prescribe 'Free Text Dietetic Product': Prosource TF 11g BD PRN"]
["3. Ensure feed prescription is printed and given to bedside  nurse"]
[{"$f":"IF(OR(B8=\"Yes\",AND(B7=\"No\",B8=0)),\"4. Ensure dietitian referral is made\",(IF(C9=\"Estimated\",\"4. Obtain accurate height when able\",(IF(C10=\"Estimated\",\"4. Obtain accurate dry weight when able\",\"\")))))","v":""}]
[{"$f":"IF(A34=\"4. Ensure dietitian referral is made\",IF(C9=\"Estimated\",\"5. Obtain accurate height when able\",IF(C10=\"Estimated\",\"5. Obtain accurate dry weight when able\",\"\")),IF(A34=\"4. Obtain accurate height when able\",IF(C10=\"Estimated\",\"5. Obtain accurate dry weight when able\",\"\"),\"\"))","v":""}]
[{"$f":"IF(A35=\"5. Obtain accurate height when able\", (IF(C10=\"Estimated\",\"6. Obtain accurate dry weight when able\",\"\")),\"\")","v":""}]